{"text_format":"1","workbook":"xlsx","n_sheets":5,"sheets":["cards","words","teachers","random","Watch Me"],"not_rendered":{"charts":0,"images":2,"macros":1,"external_links":0,"defined_names":3,"comments":0,"pivot_tables":0},"unopened":[],"bounds":{"document_bytes":16777216,"sheet_cells":100000,"rows_first":2000,"rows_last":500,"rows_between":2000,"halvings":0,"cell_chars":16384,"cell_head_chars":4096},"cells_cut":0,"cells_raw":0,"read":"whole","date_system":"1900"}

{"sheet":"cards","index":0,"n_rows":27,"n_cols":4,"rows_kept":27,"cut":false,"hidden":false,"merged":[[0,0,0,3],[14,0,14,3],[7,0,7,3],[21,0,21,3]]}
[{"$f":"words!$B$32","v":"Inequalities"}]
[]
[{"$f":"random!$B$1","v":"x > 8"},{"$f":"random!$B$2","v":"x < 1"},{"$f":"random!$B$3","v":"x <15"},{"$f":"random!$B$4","v":"x > 10"}]
[{"$f":"random!$B$5","v":"x < 8"},{"$f":"random!$B$6","v":"x > 5"},{"$f":"random!$B$7","v":"x < 1"},{"$f":"random!$B$8","v":"x < -1"}]
[{"$f":"random!$B$9","v":"x > 4"},{"$f":"random!$B$10","v":"x > 3"},{"$f":"random!$B$11","v":"x > -9"},{"$f":"random!$B$12","v":"x < 2.5"}]
[{"$f":"random!$B$13","v":"x > 3"},{"$f":"random!$B$14","v":"x > 0"},{"$f":"random!$B$15","v":"x > 1"},{"$f":"random!$B$16","v":"x < -3"}]
[]
[{"$f":"words!$B$32","v":"Inequalities"}]
[]
[{"$f":"random!$D$1","v":"x > 2.3333"},{"$f":"random!$D$2","v":"x > 8"},{"$f":"random!$D$3","v":"x < -8"},{"$f":"random!$D$4","v":"x < 12"}]
[{"$f":"random!$D$5","v":"x <15"},{"$f":"random!$D$6","v":"x > 6"},{"$f":"random!$D$7","v":"x < 4"},{"$f":"random!$D$8","v":"x > 2"}]
[{"$f":"random!$D$9","v":"x > 10"},{"$f":"random!$D$10","v":"x < 1"},{"$f":"random!$D$11","v":"x < 3"},{"$f":"random!$D$12","v":"x > 13"}]
[{"$f":"random!$D$13","v":"x > 3"},{"$f":"random!$D$14","v":"x > 0"},{"$f":"random!$D$15","v":"x > 20"},{"$f":"random!$D$16","v":"x < -2.5"}]
[]
[{"$f":"words!$B$32","v":"Inequalities"}]
[]
[{"$f":"random!$F$1","v":"x > 5"},{"$f":"random!$F$2","v":"x > 8"},{"$f":"random!$F$3","v":"x > 11"},{"$f":"random!$F$4","v":"x < -3"}]
[{"$f":"random!$F$5","v":"x < 1"},{"$f":"random!$F$6","v":"x > -3"},{"$f":"random!$F$7","v":"x > 2.3333"},{"$f":"random!$F$8","v":"x < -8"}]
[{"$f":"random!$F$9","v":"x > 3"},{"$f":"random!$F$10","v":"x > -9"},{"$f":"random!$F$11","v":"x <15"},{"$f":"random!$F$12","v":"x < 3"}]
[{"$f":"random!$F$13","v":"x > 1"},{"$f":"random!$F$14","v":"x > 13"},{"$f":"random!$F$15","v":"x < 8"},{"$f":"random!$F$16","v":"x > 3"}]
[]
[{"$f":"words!$B$32","v":"Inequalities"}]
[]
[{"$f":"random!$H$1","v":"x > 4"},{"$f":"random!$H$2","v":"x > 8"},{"$f":"random!$H$3","v":"x < 12"},{"$f":"random!$H$4","v":"x > 6"}]
[{"$f":"random!$H$5","v":"x < -3"},{"$f":"random!$H$6","v":"x < 0.25"},{"$f":"random!$H$7","v":"x < -1"},{"$f":"random!$H$8","v":"x > 3"}]
[{"$f":"random!$H$9","v":"x > 0"},{"$f":"random!$H$10","v":"x < -2.5"},{"$f":"random!$H$11","v":"x < 1"},{"$f":"random!$H$12","v":"x > 3"}]
[{"$f":"random!$H$13","v":"x > 1"},{"$f":"random!$H$14","v":"x > -9"},{"$f":"random!$H$15","v":"x > -3"},{"$f":"random!$H$16","v":"x > 5"}]

{"sheet":"words","index":1,"n_rows":33,"n_cols":3,"rows_kept":33,"cut":false,"hidden":false,"merged":[]}
[1,"x > 13","x - 3 > 10"]
[2,"x < -1","x + 1 < 0"]
[3,"x < 12","5 > x - 7"]
[4,"x < 2.5","2x + 1 < 6"]
[5,"x > 3","3x - 4 > 5"]
[6,"x > 8","10 < 2x - 6"]
[7,"x < 0.25","5x < x + 1"]
[8,"x > -3","2x > x - 3"]
[9,"x < -8","4 + x < -4"]
[10,"x < 4","3x + 1 < 2x + 5"]
[11,"x > -9","2(x + 1) > x - 7"]
[12,"x < 8","7 < 15 - x"]
[13,"x > 3","9 > 12 - x"]
[14,"x > 1","4 - 2x < 2"]
[15,"x < 1","3(x - 1) < 2(1 - x)"]
[16,"x > 2.3333","7 - 3x < 0"]
[17,"x > 5","2x + 1 > 11"]
[18,"x < 3","3x - 4 < 5"]
[19,"x > 6","2 < x - 4"]
[20,"x > 4","6 > 10 - x"]
[21,"x < 1","8 < 9 - x"]
[22,"x < -3","8x - 1 < 5x - 10"]
[23,"x > 0","2x > 0"]
[24,"x > 10","3x - 1 > x + 19"]
[25,"x < -2.5","7(x + 2) < 3x + 4"]
[26,"x > 2","4 - x > 6 - 2x"]
[27,"x > 3","2x + 1 > 5"]
[28,"x > 11","3x - 2 > 31"]
[29,"x > 20","x/2 - 1 > 9"]
[30,"x <15","3x - 7 < 38"]
[null,"Enter your word list here ^","Enter your questions here ^"]
[null,"Inequalities"]
[null,"Enter the title here ^"]

{"sheet":"teachers","index":2,"n_rows":31,"n_cols":5,"rows_kept":31,"cut":false,"hidden":false,"merged":[]}
[17,{"$f":"VLOOKUP(A1,questions,2)","v":"x > 5"},{"$f":"VLOOKUP(A1,questions,3)","v":"2x + 1 > 11"}]
[19,"x > 6","2 < x - 4"]
[3,"x < 12","5 > x - 7"]
[22,"x < -3","8x - 1 < 5x - 10",null,"These are the questions to read."]
[8,"x > -3","2x > x - 3",null,"The first column is the bingo \"cells\""]
[2,"x < -1","x + 1 < 0"]
[9,"x < -8","4 + x < -4"]
[29,"x > 20","x/2 - 1 > 9"]
[10,"x < 4","3x + 1 < 2x + 5"]
[20,"x > 4","6 > 10 - x"]
[11,"x > -9","2(x + 1) > x - 7"]
[12,"x < 8","7 < 15 - x"]
[7,"x < 0.25","5x < x + 1"]
[13,"x > 3","9 > 12 - x"]
[21,"x < 1","8 < 9 - x"]
[18,"x < 3","3x - 4 < 5"]
[5,"x > 3","3x - 4 > 5"]
[26,"x > 2","4 - x > 6 - 2x"]
[27,"x > 3","2x + 1 > 5"]
[16,"x > 2.3333","7 - 3x < 0"]
[1,"x > 13","x - 3 > 10"]
[30,"x <15","3x - 7 < 38"]
[4,"x < 2.5","2x + 1 < 6"]
[25,"x < -2.5","7(x + 2) < 3x + 4"]
[14,"x > 1","4 - 2x < 2"]
[28,"x > 11","3x - 2 > 31"]
[24,"x > 10","3x - 1 > x + 19"]
[15,"x < 1","3(x - 1) < 2(1 - x)"]
[6,"x > 8","10 < 2x - 6"]
[23,"x > 0","2x > 0"]
[null,null,"The End"]

{"sheet":"random","index":3,"n_rows":16,"n_cols":8,"rows_kept":16,"cut":false,"hidden":true,"merged":[]}
[6,{"$f":"VLOOKUP(A1,words!$A$1:$B$30,2)","v":"x > 8"},16,{"$f":"VLOOKUP(C1,words!$A$1:$B$30,2)","v":"x > 2.3333"},17,{"$f":"VLOOKUP(E1,words!$A$1:$B$30,2)","v":"x > 5"},20,{"$f":"VLOOKUP(G1,words!$A$1:$B$30,2)","v":"x > 4"}]
[15,{"$f":"VLOOKUP(A2,words!$A$1:$B$30,2)","v":"x < 1"},6,{"$f":"VLOOKUP(C2,words!$A$1:$B$30,2)","v":"x > 8"},6,{"$f":"VLOOKUP(E2,words!$A$1:$B$30,2)","v":"x > 8"},6,{"$f":"VLOOKUP(G2,words!$A$1:$B$30,2)","v":"x > 8"}]
[30,{"$f":"VLOOKUP(A3,words!$A$1:$B$30,2)","v":"x <15"},9,{"$f":"VLOOKUP(C3,words!$A$1:$B$30,2)","v":"x < -8"},28,{"$f":"VLOOKUP(E3,words!$A$1:$B$30,2)","v":"x > 11"},3,{"$f":"VLOOKUP(G3,words!$A$1:$B$30,2)","v":"x < 12"}]
[24,{"$f":"VLOOKUP(A4,words!$A$1:$B$30,2)","v":"x > 10"},3,{"$f":"VLOOKUP(C4,words!$A$1:$B$30,2)","v":"x < 12"},22,{"$f":"VLOOKUP(E4,words!$A$1:$B$30,2)","v":"x < -3"},19,{"$f":"VLOOKUP(G4,words!$A$1:$B$30,2)","v":"x > 6"}]
[12,{"$f":"VLOOKUP(A5,words!$A$1:$B$30,2)","v":"x < 8"},30,{"$f":"VLOOKUP(C5,words!$A$1:$B$30,2)","v":"x <15"},21,{"$f":"VLOOKUP(E5,words!$A$1:$B$30,2)","v":"x < 1"},22,{"$f":"VLOOKUP(G5,words!$A$1:$B$30,2)","v":"x < -3"}]
[17,{"$f":"VLOOKUP(A6,words!$A$1:$B$30,2)","v":"x > 5"},19,{"$f":"VLOOKUP(C6,words!$A$1:$B$30,2)","v":"x > 6"},8,{"$f":"VLOOKUP(E6,words!$A$1:$B$30,2)","v":"x > -3"},7,{"$f":"VLOOKUP(G6,words!$A$1:$B$30,2)","v":"x < 0.25"}]
[21,{"$f":"VLOOKUP(A7,words!$A$1:$B$30,2)","v":"x < 1"},10,{"$f":"VLOOKUP(C7,words!$A$1:$B$30,2)","v":"x < 4"},16,{"$f":"VLOOKUP(E7,words!$A$1:$B$30,2)","v":"x > 2.3333"},2,{"$f":"VLOOKUP(G7,words!$A$1:$B$30,2)","v":"x < -1"}]
[2,{"$f":"VLOOKUP(A8,words!$A$1:$B$30,2)","v":"x < -1"},26,{"$f":"VLOOKUP(C8,words!$A$1:$B$30,2)","v":"x > 2"},9,{"$f":"VLOOKUP(E8,words!$A$1:$B$30,2)","v":"x < -8"},27,{"$f":"VLOOKUP(G8,words!$A$1:$B$30,2)","v":"x > 3"}]
[20,{"$f":"VLOOKUP(A9,words!$A$1:$B$30,2)","v":"x > 4"},24,{"$f":"VLOOKUP(C9,words!$A$1:$B$30,2)","v":"x > 10"},13,{"$f":"VLOOKUP(E9,words!$A$1:$B$30,2)","v":"x > 3"},23,{"$f":"VLOOKUP(G9,words!$A$1:$B$30,2)","v":"x > 0"}]
[27,{"$f":"VLOOKUP(A10,words!$A$1:$B$30,2)","v":"x > 3"},15,{"$f":"VLOOKUP(C10,words!$A$1:$B$30,2)","v":"x < 1"},11,{"$f":"VLOOKUP(E10,words!$A$1:$B$30,2)","v":"x > -9"},25,{"$f":"VLOOKUP(G10,words!$A$1:$B$30,2)","v":"x < -2.5"}]
[11,{"$f":"VLOOKUP(A11,words!$A$1:$B$30,2)","v":"x > -9"},18,{"$f":"VLOOKUP(C11,words!$A$1:$B$30,2)","v":"x < 3"},30,{"$f":"VLOOKUP(E11,words!$A$1:$B$30,2)","v":"x <15"},15,{"$f":"VLOOKUP(G11,words!$A$1:$B$30,2)","v":"x < 1"}]
[4,{"$f":"VLOOKUP(A12,words!$A$1:$B$30,2)","v":"x < 2.5"},1,{"$f":"VLOOKUP(C12,words!$A$1:$B$30,2)","v":"x > 13"},18,{"$f":"VLOOKUP(E12,words!$A$1:$B$30,2)","v":"x < 3"},13,{"$f":"VLOOKUP(G12,words!$A$1:$B$30,2)","v":"x > 3"}]
[13,{"$f":"VLOOKUP(A13,words!$A$1:$B$30,2)","v":"x > 3"},5,{"$f":"VLOOKUP(C13,words!$A$1:$B$30,2)","v":"x > 3"},14,{"$f":"VLOOKUP(E13,words!$A$1:$B$30,2)","v":"x > 1"},14,{"$f":"VLOOKUP(G13,words!$A$1:$B$30,2)","v":"x > 1"}]
[23,{"$f":"VLOOKUP(A14,words!$A$1:$B$30,2)","v":"x > 0"},23,{"$f":"VLOOKUP(C14,words!$A$1:$B$30,2)","v":"x > 0"},1,{"$f":"VLOOKUP(E14,words!$A$1:$B$30,2)","v":"x > 13"},11,{"$f":"VLOOKUP(G14,words!$A$1:$B$30,2)","v":"x > -9"}]
[14,{"$f":"VLOOKUP(A15,words!$A$1:$B$30,2)","v":"x > 1"},29,{"$f":"VLOOKUP(C15,words!$A$1:$B$30,2)","v":"x > 20"},12,{"$f":"VLOOKUP(E15,words!$A$1:$B$30,2)","v":"x < 8"},8,{"$f":"VLOOKUP(G15,words!$A$1:$B$30,2)","v":"x > -3"}]
[22,{"$f":"VLOOKUP(A16,words!$A$1:$B$30,2)","v":"x < -3"},25,{"$f":"VLOOKUP(C16,words!$A$1:$B$30,2)","v":"x < -2.5"},5,{"$f":"VLOOKUP(E16,words!$A$1:$B$30,2)","v":"x > 3"},17,{"$f":"VLOOKUP(G16,words!$A$1:$B$30,2)","v":"x > 5"}]

{"sheet":"Watch Me","index":4,"n_rows":0,"n_cols":0,"rows_kept":0,"cut":false,"hidden":false,"merged":[]}